- 博客(57)
- 资源 (8)
- 收藏
- 关注
原创 美团 Robust 热更异常 haven‘t insert code by Robust.Cannot patch this method, method.signature
美团热更 Robust 打热更包异常 haven't insert code by Robust.Cannot patch this method, method.signature 解决方案
2022-06-01 14:29:10
441
原创 Could not create task ‘:app:minifyReleaseWithR8‘. Cannot query the value of this provider because it
最近在研究热更新,移植美团的Robust项目,根据文档配置插件,gradle编译的过程中遇到如题的问题,找了好久各种方案都不凑效,终于在stackoverflow上的一篇帖子解决了我的问题。在此表示感谢。报错截图:我的问题的解决是修改app下的build.gradle 的 buildToolsVersion修改前:compileSdkVersion 30buildToolsVersion "31.0.0"改成后:compileSdkVersion 30buildT.
2022-05-28 16:23:22
2268
原创 Warning: Setting the NODE_TLS_REJECT_UNAUTHORIZED environment variable to ‘0‘ makes TLS connections
在使用npm 创建项目的时候,报错:Warning: Setting the NODE_TLS_REJECT_UNAUTHORIZED environment variable to '0' makes TLS connections and HTTPS requests insecure by disabling certificate verification.(Use `node --trace-warnings ...` to show where the warning was created)
2022-01-11 13:04:00
23761
3
原创 VUE 聊天文本中的http及https链接实现可点击处理
项目需求,做一个聊天的软件,其中有个需求要识别聊天文本中的链接地址,并支持点击。实现方法如下:1.写一个函数接收文本内容,解析出其中的链接部分,并生成链接标签。2.直接使用v-html展示解析完的标签内容。上代码段:<div class="text-box" :key="index2" v-html="linkUrl(item2.text)"></div>解析函数linkUrl:linkUrl(str){ if(
2022-01-10 17:45:11
1994
原创 CERT_HAS_EXPIRED
npm 安装md5报错,提示证书过期:npm ERR! code CERT_HAS_EXPIREDnpm ERR! errno CERT_HAS_EXPIREDnpm ERR! request to https://r.cnpmjs.org/md5 failed, reason: certificate has expirednpm ERR! A complete log of this run can be found in:npm ERR! D:\Tool\WorkToo...
2021-10-20 17:05:05
9602
5
原创 android.content.ActivityNotFoundException: No Activity found to handle Intent 问题解决
anandroid 隐式跳转报错,如下:以下是我的跳转代码:AndroidManifest配置如下:问题:出在AndroidManifest配置,应该要加一条,加上这一条就OK了。<category android:name="android.intent.category.DEFAULT" />...
2021-06-04 15:04:28
3503
1
原创 各类工具链接
------Android------ICON在线生成:https://icon.wuruihong.com/icon?utm_source=dk8yK6Ov#/android
2021-05-20 13:54:11
116
原创 Android Activity跳转到cocos的AppActivity 的问题
最近有个需求,是在原生的Android工程里面植入cocos游戏,我是把cocos游戏构建成一个Android工程,以依赖库的形式供Android原生工程调用,遇到如下问题:环境:cocosCreator2.4.3androidStudio:4.1.2问题1.安卓Activity跳转到AppActivity,直接跳转失败:该问题是因为如果AppActivity不是根Activity的话,引擎里面直接做了拦截,只要搜索“isTaskRoot”把相关的拦截全注释掉,就OK了:问题..
2021-05-15 15:49:18
1319
原创 cocosCreator 导出Android工程报错 couldn‘t find “libcocos2djs.so“
报错提示如下: java.lang.UnsatisfiedLinkError: dalvik.system.PathClassLoader[DexPathList[[zip file "/data/app/com.ys.ysadsense-C8d62Jm4Fwh94RL6zuZ1jA==/base.apk"],nativeLibraryDirectories=[/data/app/com.ys.ysadsense-C8d62Jm4Fwh94RL6zuZ1jA==/lib/arm64, /data/a..
2021-05-13 16:03:02
2842
原创 Execution failed for task ‘:app:checkDebugAarMetadata‘. > Could not resolve all files for configurat
好几年没有搞过安卓了(15后再没搞过了),最近因公司需求,又开始搞安卓,发现改变好大,好了,言归正传,我接入了一个百度的广告SDK, 按照要求把.aar包放进了libs目录,也按文档在build.gradle(:app)中 implementation了一系列的依赖,最后Rebuild project时报如下错误:Execution failed for task ':app:checkDebugAarMetadata'.> Could not resolve all files for con
2021-05-08 10:17:03
16737
原创 2021-02-18
cocosCreator 2.3.4 和2.2.0版本打包,构建报以下错误:Build Failed: Error: rpk包构建失败!错误:Error: Command failed: nodeC:\Program Files (x86)\Tool\WorkTool\CocosDashboard_1.0.11\resources\.editors\Creator\2.4.3\resources\builtin\runtime-adapters\package\index.jsD:\workSp..
2021-02-18 18:10:12
631
原创 Laya 笔记-LayaAir基础篇
屏幕适配获取浏览器DPR(Device Pixel Ratio)设备像素比:Laya.Browser.pixelRatio逻辑宽高(逻辑分辨率的宽高):Laya.Browser.clientWidth、Laya.Browser.clientHeight物理宽高(物理分辨率):Laya.Browser.width、Laya.Browser.height设计宽高:在LayaAir引擎里,初始化引擎的init(宽,高)值对应的就是设计宽高。如Laya.init(750, 1334);引..
2020-06-04 00:57:52
1989
原创 cocosCreator 模块中文解释
在用cocosCreator开发微信小游戏的时候,由于微信只允许上传4M的发布包,所以包体成为开发者斤斤计较的对象.但有时候我们游戏明明没有什么资源,但是编译后却发现空间不足,这是因为cocosCreator引擎本身携带的组件就占用很大的空间.这就需要我们手动将我们游戏中不需要用到的组件给剔除掉,压缩空间.选择项目-->项目设置-->在项目设置弹出中选择模块设置,剔除你不需要用到的...
2020-03-04 13:08:09
1657
原创 cocosCreator 接入QQ排行榜子域中遇到的坑二:图片设置颜色问题
最近移植微信小游戏到QQ平台,移植排行榜时遇到如下问题:Canvas.js:60 Uncaught TypeError: Cannot redefine property: clientWidth at Function.defineProperty (<anonymous>) at new Canvas (Canvas.js:60) at HTMLD...
2020-01-14 17:53:43
579
原创 cocosCreator 接入QQ排行榜子域中遇到的坑一:label组件的坑(Uncaught TypeError: Cannot read property ‘context‘ of null)
最近在做小游戏多平台接入,从WX平台移植到QQ平台,其他的都还挺顺利的,API基本一样,几乎是只要将wx.改成qq.就行了,但是在接入排行榜的时候遇到一些坑,特列出如下,希望给掉入这些坑的同行一个参考(我的开发环境是cocosCreator 2.1.0)。坑一:在自域中使用label组件,且使用默认字体时报如下错误:Canvas.js:60 Uncaught TypeError:...
2020-01-14 17:33:56
1143
3
原创 开放数据域从cocos1.9.3切换到cocos2.1.0版本,排行榜列表滑动不了问题
最近移植了一个游戏从cocos1.9.3切换到cocos2.0.1,按照API,主域有用WXSubContextView组件,接完后测试发现,排行榜列表无法滑动,尝试了以下方法始终无效:1.把自己的改成官方给的demo一模一样,无效;2.在项目设置中,将所有的模块都勾选上,无效;3.把官方的子域直接放入我的工程调用,无效;最后发现原因是,官方的demo是直接放置在scene的Can...
2019-11-18 16:25:03
287
原创 QQ小程序 应用类型不匹配
QQ小程序开发者工具点预览,无法生成二维码,报错如下遇到这种情况,查看你的小游戏服务类目有没有设置,没有设置请设置,就可以预览和上传了刚接触QQ小游戏平台,以上的坑仅代表我当前的环境发生的问题,仅供参考,希望对和我相同原因导致此问题的小伙伴提供解决思路。...
2019-08-02 15:56:03
1693
原创 QQ小游戏接入问题:Uncaught TypeError: wx.saveFile is not a function
最近公司cocosCreator开发的小游戏接QQ小游戏,遇到一些问题,记录一下,方便其他朋友遇到同样问题及时应对。我的小游戏包>8M 无法上传,删除res后,报如下错误wx.saveFile is not a function按照提示将build\wechatgame\libs下所有的的wx-downloader.js的wx.改成qq. 还是报错明明文档里面...
2019-08-02 15:52:40
703
原创 申请微信小游戏流量主提示 “填写的姓名或身份证与公众号主体信息不一致”
最近在整微信小游戏,在开通流量主(个人主体)提交申请信息的时候,一直提示“填写的姓名或身份证与公众号主体信息不一致”,我核对了N次,就是没发现有不一致的。折腾了很久,最后发现个大坑,“开户名称”那一栏,填的并不是我们理解的银行开户银行名称,而是你的姓名。就这项,把我折腾惨了,留个记录,防止后面有人踩到此坑。...
2019-06-06 14:35:17
4431
转载 错误: 找不到或无法加载主类 org.gradle.wrapper.GradleWrapperMain
再androidStudio中执行gradlew命令报错:错误: 找不到或无法加载主类 org.gradle.wrapper.GradleWrapperMain解决办法:查看项目的 \gradle\wrapper目录下是否缺失gradle-wrapper.jar文件,若是,则到别的工程拷贝一份放在该目录下,即可。 参考链接:https://blog.youkuaiyun.com/qq_2545...
2018-12-03 16:28:05
2877
原创 百度网盘安装完启动 “应用程序被修改 请重新安装”
百度网盘安装完启动 “应用程序被修改 请重新安装”,如下图:我的解决办法是:1.卸载该软件2.设置系统时间,关闭自动设置系统时间,手动将系统时间往前调(我调到了2016年)...
2018-10-23 10:41:45
22711
4
原创 Xcode到处ipa报错解决
应客户需求要打个ipa包给他们测试,谁知导出包的时候报如下错:ipatool failed with an exception: #<NoMethodError: undefined method `toolsPath' for nil:NilClass> /Applications/Xcode.app/Contents/Developer/usr/bin/ipatool:811...
2018-06-09 10:38:55
3600
原创 cocos2d-x WebView 接入的问题
最近项目需要在游戏中做播放网络视屏的功能,发现cocos有自带的WebView,于是就直接从testcpp中把代码搬了进来,如下:、 Size winSize = Director::getInstance()->getVisibleSize(); _webView = cocos2d::experimental::ui::WebView::create();
2017-03-20 15:46:40
3626
原创 引发的异常: 0xC0000005: 读取位置 0x53746573
贴上代码,红色为异常跳出的地方,debug跟踪,name并非空值,在网上查了也没找到问题,最后在同事提示下解决问题:%s 对应的打印参数必须是 char*类型的,于是我将输出改为 CCLOG("readPlist--- name: %s",name.c_str()); 问题解决。std::string filePath = FileUtils::getI
2017-03-03 14:16:33
8885
原创 ndk-build JNI头文件错误 error: unknown type name 'JNIEXPORT'
在用 ndk-build编译生成.so文件的时候报一下错误,记录一下:G:\支付宝_支付\WS_APP_PAY_SDK_BASE_2.0\WS_APP_PAY_SDK_BASE_2.0\客户端Demo\AndroidDemo_2.0(SDK_15.2.8)\AndroidDemo_2.0(SDK_15.2.8)\AndroidDemo_2.0\alipay_demo\jni>ndk-bui
2017-03-01 12:45:03
5007
原创 javah -jni org.cocos2dx.cpp.JniTest 错误: 找不到 'org.cocos2dx.cpp.JniTest' 的类文件。
如题,出现以下异常但是JniTest文件以及其生成的JniTest.class都正常查找了很多资料都没找到答案,最后在一篇博客中找到了方案解决方案:在前面增加option "-classpath . 或 -cp . " javah -classpath . -jni org.cocos2dx.cpp.JniTest或jav
2017-03-01 09:52:05
870
原创 libgdx NativeLabel addListener点击事件没响应
最近用NativeLabel发现一个问题,添加点击事件,无法收到相应,而用 Label却可以解决,群里问了下Vchar_3D大牛,原因是NativeLabel不会自动测量大小,默认Size大小为0,必须说在设置和更新内容的时候要添加方法nll.setSize(nll.getPrefWidth(), nll.getPrefHeight());手动设置NativeLab
2016-12-24 17:22:35
549
原创 libgdx Error generating final archive: Fougnd duplicate file for APK: LICENSE.txt 异常
又有好久没用过Libgdx了,最近公司需要开发一款棋牌游戏,研究决定再次启用Libgdx引擎。我目前用的版本是老版本,用得很不爽,决定升级新版本,下了个1.9.3版本的,替换掉gdx-backend-android.jar和gdx.jar。运行时报以下错误: 搜了下LICENSE.txt没找到该文件,一脸懵逼。。。于是去gdx群里(187378034)请教各位大侠。杭州
2016-11-29 10:25:25
413
原创 android 路径及文件操作
private void testFile(){ try { File[] files=File.listRoots();//路径:/ File data=Environment.getDataDirectory();//data根目录,路径:/data File downloadCache=Environment.getD
2016-08-19 11:47:34
364
原创 零散知识
setCompoundDrawables 画的drawable的宽高是按drawable.setBound()设置的宽高,所以才有The Drawables must already have had setBounds(Rect) called.使用之前必须使用Drawable.setBounds设置Drawable的长宽。setCompoundDrawablesWithIntr
2016-08-19 11:19:33
303
原创 相关博客
大牛博客http://blog.youkuaiyun.com/guolin_blog?viewmode=contentshttp://blog.youkuaiyun.com/lmj623565791?viewmode=contents源码包导入与查看http://blog.youkuaiyun.com/xiaanming/article/details/9031141信息安全与攻击http
2016-08-19 11:04:53
451
原创 android 多个Icon启动多个入口Activity
最近接了个任务,boss的想法是,模仿豌豆荚,金山助手之类的应用,在安装我们的应用时,在桌面另外创建一个伪文件夹,里面放我们自己的游戏快捷,点击某个快捷时:1.如果下载并安装了该应用,就直接启动该应用2.如果没下载,则从服务器下载。用来作为我们游戏推广的一个入口。豌豆荚的效果:,红色框住的是他的伪文件夹,和左边的系统默认的文件夹效果(不同手机系统的文件夹图标是不一样的)还是
2015-06-03 16:37:19
1357
原创 cocos2d-x android真机运行读取文件 报 Fatal signal 11 (SIGSEGV) at 0xdeadaad (code=1), thread 20446 (Thread-12
今天给游戏加入关卡信息,我选用了.CSV文件但是在真机上运行的时候遇到一个问题(VS直接在Windows下运行一切正常),错误日志如下:贴上代码: // 读取文件数据 std::string path = FileUtils::getInstance()->fullPathForFilename("levels.csv");
2015-03-12 17:08:35
1205
原创 cocos2d-x Expression: invalid null pointer Expression: invalid null pointer 问题
上问题:Debug Assertion Failed!Program: C:\Windows\system32\MSVCP110D.dllFile: c:\program files (x86)\microsoft visual studio 11.0\vc\include\xstringLine: 1143Expression: invalid null pointe
2015-03-05 18:14:46
3257
原创 cocos2d-x error C2143: 语法错误 : 缺少“;”(在“*”的前面)
因公司需求,从android 转到 C++,用cocos开发,刚接触各种问题,今天遇到的小问题,特此记录下来:先贴问题:f:\cocos2dworkspace\bubbletest2\classes\helloworldscene.h(21): error C2143: 语法错误 : 缺少“;”(在“*”的前面) (..\Classes\AppDelegate.cpp)2>f:\c
2015-03-04 14:54:07
3803
原创 语法错误 : 缺少“;”(在“using”的前面) 问题
最近解除C++,很多东西都不了解今天写了段代码报错2>ClCompile:2> HelloWorldScene.cpp2> SecondLayer.cpp2>e:\cocos2dworkspace\gametest\classes\secondlayer.cpp(3): error C2143: 语法错误 : 缺少“;”(在“using”的前面)2>e:\cocos2d
2015-01-31 14:38:37
7469
原创 关于Android 的Socket请求导致应用卡的问题
最近在做网络版的斗地主,设计是这样子的:1,游戏的房间等信息用Socket的问答形式,也就是说,每一个请求都启动一个Socket,请求玩,直接关闭Socket2.游戏过程中的数据用Socket的长连接实现。保证消息的及时性。但是在开发的过程中遇到一个问题,就是在没有网络的情况下游戏运行速度很快,但是在有网络的情况下,游戏运行很卡,甚至报ANR。源码
2014-10-08 11:30:19
1104
原创 Android Android Unable to resolve target 'android-19' 问题
今天接支付,遇到这个问题。记录下来
2014-08-25 14:23:54
837
缩略图补丁,支持:PSD EPS AI TIF TGA等
2020-04-09
Git-2.19.1-64-bit.exe
2018-10-16
TexturePacker 破解版
2015-03-24
空空如也
TA创建的收藏夹 TA关注的收藏夹
TA关注的人