- 博客(108)
- 收藏
- 关注
原创 CentOS 8在Linux虚拟机修改IP地址,出现:错误:“ens160“ 不是活动的连接。错误:未提供活动连接。
解决:错误:"ens160" 不是活动的连接。错误:未提供活动连接。
2024-10-21 20:31:24
654
原创 在Linux操作系统上安装NVM教程——CentOS 8/VMware 17版本
如何在Linux操作系统上安装NVM,CentOS 8下载安装nvm和node
2024-10-17 15:09:37
648
原创 执行node.js获取本机Ip命令,报:Error: Cannot find module ‘ip‘错误
解决Error: Cannot find module 'ip'
2024-10-10 19:33:37
606
原创 解决:Unknown custom element: did you register the component correctly? For recursive components...问题
Unknown custom element: did you register the component correctly? For recursive components, make sure to provide the "name" option.
2024-09-14 15:01:57
897
原创 解决:Module build failed (from ./node_modules/sass-loader/dist/cjs.js)问题
vue3项目使用scss出现Module build failed (from ./node_modules/sass-loader/dist/cjs.js):Error: Cannot find module 'sass'问题
2024-09-06 16:19:53
2219
原创 Spring Boot3.3.X整合Mybatis-Plus
解决Spring boot整合mybatis-plus后不能实现mybatis-plus自带的方法,出现Invalid bound statement (not found)错误,仅需导入一个依赖轻松搞定
2024-08-15 14:24:45
6715
4
原创 解决:Resolved [org.springframework.web.HttpMediaTypeNotSupportedException: Content-Type ‘multipart问题
Resolved [org.springframework.web.HttpMediaTypeNotSupportedException: Content-Type 'multipart/form-data;boundary=--------------------------083037624092353169827681;charset=UTF-8' is not supported]
2024-08-15 11:30:11
2187
原创 运行python项目出现ModuleNotFoundError: No module named ‘sklearn‘问题
运行python项目出现ModuleNotFoundError: No module named 'sklearn'问题
2024-07-26 10:15:32
634
原创 java.util.concurrent.ExecutionException: com.aliyun.sdk.gateway.pop.exception.PopClientException
对接阿里云短信验证码服务,出现java.util.concurrent.ExecutionException: com.aliyun.sdk.gateway.pop.exception.PopClientException: (Code: MissingAccessKeyId Message: code: 400, AccessKeyId is mandatory for this action. request id: 89B9CEC0-82FE-506A-AFE4-8F78CAF6D78C问题
2024-07-18 14:00:12
858
原创 启动nacos出现Caused by: com.alibaba.nacos.api.exception.NacosException: Nacos Server did..问题
启动nacos出现Caused by: com.alibaba.nacos.api.exception.NacosException: Nacos Server did not start because dumpservice bean construction failure : No DataSource set问题
2024-04-11 16:51:04
3277
2
原创 解决:Cannot read properties of undefined (reading ‘validate‘)问题
解决Element UI使用表单校验功能控制台出现Cannot read properties of undefined (reading 'validate')报错
2024-04-09 15:41:26
2969
原创 问题:package.org.mortbay.jetty:servlet-api:jar:9.0.56 was not found in XXX报错
package.org.mortbay.jetty:servlet-api:jar:9.0.56 was not found in XXX
2024-03-07 23:39:03
220
原创 java.lang.ClassCastException: class java.util.HashMap cannot be cast to class java.util.Collection
解决:java.lang.ClassCastException: class java.util.HashMap cannot be cast to class java.util.Collection (java.util.HashMap and java.util.Collection are in module java.base of loader 'bootstrap')报错
2024-03-03 22:33:43
1415
原创 Date类型转成字符类型(String),字符类型(String)转成Date类型
获取yyyy-MM-dd HH:mm:ss格式日期时间格式,Date类型转成字符类型(String),字符类型(String)转成Date类型
2024-01-26 14:28:31
447
原创 解决:Cannot call sendError() after the response has been committed问题
解决:Cannot call sendError() after the response has been committed问题
2024-01-19 16:27:43
2389
空空如也
空空如也
TA创建的收藏夹 TA关注的收藏夹
TA关注的人